Target
Leukotriene B4 receptor 1
Ligand
BDBM50036749
Substrate
Meas. Tech.
ChEMBL_99517 (CHEMBL707241)
IC50
85±n/a nM
Citation
 Sofia, MJJackson, WTSaussyJr., DLSilbaugh, SAFroelich, LLCockerham, SLStengel, PW Ortho-alkoxyphenol leukotriene B4 receptor antagonists Bioorg Med Chem Lett 2:1669-1674 (1992)    Article 
Target
Name:
Leukotriene B4 receptor 1
Synonyms:
BLT BLTR Chemoattractant receptor-like 1 GPR16 LTB4-R 1 Leukotriene B4 R1 Leukotriene B4 receptor 1 P2Y purinoceptor 7 | P2Y7
Type:
Enzyme Catalytic Domain
Mol. Mass.:
37582.68
Organism:
Homo sapiens (Human)
Description:
Q15722
Residue:
352
  
Inhibitor
Name:
BDBM50036749
Synonyms:
1-{5-ethyl-2-hydroxy-4-[6-methyl-6-(2H-1,2,3,4-tetraazol-5-yl)heptyloxy]phenyl}-1-ethanone; with sodium ion LY-255283 sodium 1-{5-ethyl-2-hydroxy-4-[6-methyl-6-(2H-1,2,3,4-tetraazol-5-yl)heptyloxy]phenyl}-1-ethanone
Type:
Small organic molecule
Emp. Form.:
C19H27N4O3
Mol. Mass.:
359.4432
SMILES:
CCc1cc(C(C)=O)c(O)cc1OCCCCCC(C)(C)c1nn[n-]n1
: