Target
Leukotriene B4 receptor 1
Ligand
BDBM50280290
Substrate
Meas. Tech.
ChEMBL_99654 (CHEMBL709312)
IC50
6±n/a nM
Citation
 Sofia, MJSaussyJr., DLJackson, WTMarder, PSilbaugh, SAFroelich, LLCockerham, SLStengel, PW Ortho-alkoxyphenol leukotriene B4 receptor antagonists: effect of a chroman carboxylic acid. Bioorg Med Chem Lett 2:1675-1680 (1992)    Article 
Target
Name:
Leukotriene B4 receptor 1
Synonyms:
BLT BLTR Chemoattractant receptor-like 1 GPR16 LTB4-R 1 Leukotriene B4 R1 Leukotriene B4 receptor 1 P2Y purinoceptor 7 | P2Y7
Type:
Enzyme Catalytic Domain
Mol. Mass.:
37582.68
Organism:
Homo sapiens (Human)
Description:
Q15722
Residue:
352
  
Inhibitor
Name:
BDBM50280290
Synonyms:
4-ethyl-2-methoxy-5-[6-methyl-6-(2H-1,2,3,4-tetraazol-5-yl)heptyloxy]phenol; with sodium ion sodium 4-ethyl-2-methoxy-5-[6-methyl-6-(2H-1,2,3,4-tetraazol-5-yl)heptyloxy]phenol
Type:
Small organic molecule
Emp. Form.:
C18H27N4O3
Mol. Mass.:
347.4325
SMILES:
CCc1cc(OC)c(O)cc1OCCCCCC(C)(C)c1nn[n-]n1
: