Target
Leukotriene B4 receptor 1/2
Ligand
BDBM50036750
Substrate
Meas. Tech.
ChEMBL_88360 (CHEMBL702582)
IC50
206±n/a nM
Citation
 Sofia, MJSaussyJr., DLJackson, WTMarder, PSilbaugh, SAFroelich, LLCockerham, SLStengel, PW Ortho-alkoxyphenol leukotriene B4 receptor antagonists: effect of a chroman carboxylic acid. Bioorg Med Chem Lett 2:1675-1680 (1992)    Article 
Target
Name:
Leukotriene B4 receptor 1/2
Synonyms:
Leukotriene B4 receptor
Type:
Mol. Mass.:
Description:
ASSAY_ID of ChEMBL is 88360
Components:
This complex has 2 components.
Component 1
Name:
Leukotriene B4 receptor 2
Synonyms:
BLT2R LT4R2_HUMAN LTB4-R 2 LTB4R2 Leukotriene B4 Leukotriene B4 receptor Leukotriene B4 receptor BLT2 Seven transmembrane receptor BLTR2
Type:
Enzyme Catalytic Domain
Mol. Mass.:
37964.86
Organism:
Homo sapiens (Human)
Description:
Leukotriene 2 0 HUMAN::Q9NPC1
Residue:
358
  
Component 2
Name:
Leukotriene B4 receptor 1
Synonyms:
BLT BLTR Chemoattractant receptor-like 1 GPR16 LTB4-R 1 Leukotriene B4 R1 Leukotriene B4 receptor 1 P2Y purinoceptor 7 | P2Y7
Type:
Enzyme Catalytic Domain
Mol. Mass.:
37582.68
Organism:
Homo sapiens (Human)
Description:
Q15722
Residue:
352
  
Inhibitor
Name:
BDBM50036750
Synonyms:
2-ethoxy-4-ethyl-5-[6-methyl-6-(2H-1,2,3,4-tetraazol-5-yl)heptyloxy]phenol; with sodium ion Sodium salt of 2-Ethoxy-4-ethyl-5-[6-methyl-6-(2H-tetrazol-5-yl)-heptyloxy]-phenol | sodium 2-ethoxy-4-ethyl-5-[6-methyl-6-(2H-1,2,3,4-tetraazol-5-yl)heptyloxy]phenol
Type:
Small organic molecule
Emp. Form.:
C19H29N4O3
Mol. Mass.:
361.4591
SMILES:
CCOc1cc(CC)c(OCCCCCC(C)(C)c2nn[n-]n2)cc1O
: