Target
Type-1 angiotensin II receptor
Ligand
BDBM50280319
Substrate
Meas. Tech.
ChEBML_36160
IC50
470±n/a nM
Citation
 Murray, WVLalan, PGill, AAddo, MFLewis, JMLee, DKRampulla, RWachter, MPHsi, JDUnderwood, DC Substituted piperidin-2-one biphenyltetrazoles as angiotensin II antagonists Bioorg Med Chem Lett 2:1775-1779 (1992)    Article 
Target
Name:
Type-1 angiotensin II receptor
Synonyms:
AGTR1 Angiotensin II type 1a (AT-1a) receptor
Type:
PROTEIN
Mol. Mass.:
41107.81
Organism:
Bos taurus
Description:
ChEMBL_36779
Residue:
359
  
Inhibitor
Name:
BDBM50280319
Synonyms:
CHEMBL299151 | [4-Butyl-4-methyl-6-oxo-1-[2'-(1H-tetrazol-5-yl)-biphenyl-4-ylmethyl]-piperidin-(2E)-ylidene]-acetic acid ethyl ester
Type:
Small organic molecule
Emp. Form.:
C28H33N5O3
Mol. Mass.:
487.5933
SMILES:
CCCCC1(C)CC(=O)N(Cc2ccc(cc2)-c2ccccc2-c2nnn[nH]2)\C(C1)=C\C(=O)OCC
: