Target
Sterol O-acyltransferase 1
Ligand
BDBM50280416
Substrate
Meas. Tech.
ChEBML_48914
IC50
14±n/a nM
Citation
 Ashton, MJBridge, AWBush, RCDron, DIHarris, NVJones, GDLythgoe, DJRiddell, DSmith, C RP 70676: A potent systematically available inhibitor of acyl-CoA:cholesterol O-acyl transferase (ACAT) Bioorg Med Chem Lett 2:375-380 (1992)    Article 
Target
Name:
Sterol O-acyltransferase 1
Synonyms:
ACAT-1 Acat SOAT1_RAT Sterol O-acyltransferase, Soat
Type:
PROTEIN
Mol. Mass.:
64165.56
Organism:
Rattus norvegicus
Description:
ChEMBL_28796
Residue:
545
  
Inhibitor
Name:
BDBM50280416
Synonyms:
2-[3-(1-Methyl-1H-imidazol-2-ylsulfanyl)-propylsulfanyl]-4,5-diphenyl-1H-imidazole | CHEMBL340487
Type:
Small organic molecule
Emp. Form.:
C22H22N4S2
Mol. Mass.:
406.567
SMILES:
Cn1ccnc1SCCCSc1nc(c([nH]1)-c1ccccc1)-c1ccccc1
: