Target
Polyunsaturated fatty acid 5-lipoxygenase
Ligand
BDBM22971
Substrate
Meas. Tech.
ChEMBL_3893 (CHEMBL619408)
IC50
24000±n/a nM
Citation
 Boschelli, DHConnor, DTKuipers, PJWright, CD Synthesis and cyclooxygenase and 5-lipoxygenase inhibitory activity of some thiazolidene-4-one analogs of meclofenamic acid Bioorg Med Chem Lett 2:705-708 (1992)    Article 
Target
Name:
Polyunsaturated fatty acid 5-lipoxygenase
Synonyms:
Alox5 LOX5_RAT
Type:
PROTEIN
Mol. Mass.:
78082.31
Organism:
Rattus norvegicus
Description:
ChEMBL_1432947
Residue:
673
  
Inhibitor
Name:
BDBM22971
Synonyms:
2-[(2,6-dichloro-3-methylphenyl)amino]benzoic acid Meclofenamate US11337935, Compound Meclofenamic-acid | US20240002326, Compound Meclofenamic acid
Type:
Small organic molecule
Emp. Form.:
C14H11Cl2NO2
Mol. Mass.:
296.149
SMILES:
Cc1ccc(Cl)c(Nc2ccccc2C(O)=O)c1Cl
: