Target
Acetylcholinesterase
Ligand
BDBM8961
Substrate
Meas. Tech.
ChEBML_29087
IC50
230±n/a nM
Citation
 Shutske, GMBores, GMBradshaw, KCHuger, FPKapples, KJLarsen, RDRush, DKTomer, JD Synthesis and biological activity of putative mono-hydroxylated metabolites of velnacrine Bioorg Med Chem Lett 2:865-870 (1992)    Article 
Target
Name:
Acetylcholinesterase
Synonyms:
ACES_RAT Acetylcholinesterase and butyrylcholinesterase (AChE and BChE) Acetylcholinesterase, AChE | Ache
Type:
Enzyme
Mol. Mass.:
68193.62
Organism:
Rattus norvegicus (rat)
Description:
P37136
Residue:
614
  
Inhibitor
Name:
BDBM8961
Synonyms:
1,2,3,4-tetrahydro-9-acridinamine 9-THA CHEMBL1337960 Cognex Tracine cid_1935 | tacrine.HCl
Type:
Small organic molecule
Emp. Form.:
C13H14N2
Mol. Mass.:
198.2637
SMILES:
Nc1c2CCCCc2nc2ccccc12
: