Target
Cysteinyl leukotriene receptor 1
Ligand
BDBM50280687
Substrate
Meas. Tech.
ChEMBL_99863 (CHEMBL706933)
IC50
0.450000±n/a nM
Citation
 Labelle, MPrasit, PBelley, MBlouin, MChampion, ECharette, LDeLuca, JGDufresne, CFrenette, RGauthier, JYGrimm, EGrossman, SJGuay, DHerold, EGJones, TRLau, CKLeblanc, YLéger, SLord, AMcAuliffe, M The discovery of a new structural class of potent orally active leukotriene D4 antagonists Bioorg Med Chem Lett 2:1141-1146 (1992)    Article 
Target
Name:
Cysteinyl leukotriene receptor 1
Synonyms:
CLTR1_CAVPO | CYSLTR1
Type:
Enzyme Catalytic Domain
Mol. Mass.:
39007.58
Organism:
GUINEA PIG
Description:
Leukotriene D4 0 GUINEA PIG::Q2NNR5
Residue:
340
  
Inhibitor
Name:
BDBM50280687
Synonyms:
CHEMBL280310 | Sodium; 2-[1-[3-(7-chloro-quinolin-2-ylmethoxy)-phenyl]-3-(2-ethylcarbamoyl-phenyl)-propylsulfanylmethyl]-butyrate
Type:
Small organic molecule
Emp. Form.:
C33H34ClN2O4S
Mol. Mass.:
590.153
SMILES:
CCNC(=O)c1ccccc1CCC(SCC(CC)C([O-])=O)c1cccc(OCc2ccc3ccc(Cl)cc3n2)c1
: