Target
Glutamate receptor ionotropic, NMDA 1
Ligand
BDBM50212605
Substrate
Meas. Tech.
ChEMBL_142508 (CHEMBL747201)
IC50
339000±n/a nM
Citation
 Leeson, PDWilliams, BJRowley, MMoore, KWBaker, RKemp, JAPriestley, TFoster, ACDonald, AE Derivatives of 1-hydroxy-3-aminopyrrolidin-2-one (HA-966). Partial agonists at the glycine site of the NMDA receptor Bioorg Med Chem Lett 3:71-76 (1993)    Article 
Target
Name:
Glutamate receptor ionotropic, NMDA 1
Synonyms:
Glutamate (NMDA) receptor subunit zeta 1 Glutamate-NMDA-Channel Glutamate-NMDA-Polyamine NMDA Nmdar1 | phencyclidine
Type:
Enzyme Catalytic Domain
Mol. Mass.:
105533.40
Organism:
RAT
Description:
P35439
Residue:
938
  
Inhibitor
Name:
BDBM50212605
Synonyms:
CHEMBL351464
Type:
Small organic molecule
Emp. Form.:
C4H8N2O2
Mol. Mass.:
116.1185
SMILES:
NC1CCN(O)C1=O
: