Target
Glutamate receptor ionotropic, NMDA 1
Ligand
BDBM50280805
Substrate
Meas. Tech.
ChEBML_140324
Ki
7040±n/a nM
Citation
 Smith, ECMcQuaid, LACalligaro, DOO'Malley, PJ Structure-activity relationships of a series of glycine antagonists related to 5,7-dichlorokynurenic acid and 3-(2-carboxy-6-chloroindol-3-yl)acetic acid Bioorg Med Chem Lett 3:81-84 (1993)    Article 
Target
Name:
Glutamate receptor ionotropic, NMDA 1
Synonyms:
Glutamate (NMDA) receptor subunit zeta 1 Glutamate-NMDA-Channel Glutamate-NMDA-Polyamine NMDA Nmdar1 | phencyclidine
Type:
Enzyme Catalytic Domain
Mol. Mass.:
105533.40
Organism:
RAT
Description:
P35439
Residue:
938
  
Inhibitor
Name:
BDBM50280805
Synonyms:
3-(2-Carboxy-ethyl)-5,7-dichloro-4-oxo-1,4-dihydro-quinoline-2-carboxylic acid | CHEMBL166426
Type:
Small organic molecule
Emp. Form.:
C13H9Cl2NO5
Mol. Mass.:
330.12
SMILES:
OC(=O)CCc1c(O)c2c(Cl)cc(Cl)cc2nc1C(O)=O
: