Target
Neutrophil elastase
Ligand
BDBM50281086
Substrate
Meas. Tech.
ChEBML_63816
IC50
45000±n/a nM
Citation
 Adonias, MAnayaba, JCámara, JCanet, EGateau-Olesker, AGero, SDGrande, MHernando, JI Enantioselective synthesis and antielastase activity of 1,3,4-trisubstituted and 3,4-disubstituted β-lactam antibiotics Bioorg Med Chem Lett 3:2547-2552 (1993)    Article 
Target
Name:
Neutrophil elastase
Synonyms:
Bone marrow serine protease Coagulation factor X ELANE Elastase HLE Leukocyte elastase Medullasin Neutrophil elastase (HNE) PMN elastase Trypsin
Type:
Enzyme
Mol. Mass.:
28532.38
Organism:
Homo sapiens (Human)
Description:
P08246
Residue:
267
  
Inhibitor
Name:
BDBM50281086
Synonyms:
(3S,4S)-1,4-Diacetyl-3-butyl-azetidin-2-one | CHEMBL418925
Type:
Small organic molecule
Emp. Form.:
C11H17NO3
Mol. Mass.:
211.2576
SMILES:
CCCC[C@H]1[C@H](N(C(C)=O)C1=O)C(C)=O
: