Target
Neutrophil elastase
Ligand
BDBM50199883
Substrate
Meas. Tech.
ChEBML_63816
IC50
100±n/a nM
Citation
 Adonias, MAnayaba, JCámara, JCanet, EGateau-Olesker, AGero, SDGrande, MHernando, JI Enantioselective synthesis and antielastase activity of 1,3,4-trisubstituted and 3,4-disubstituted β-lactam antibiotics Bioorg Med Chem Lett 3:2547-2552 (1993)    Article 
Target
Name:
Neutrophil elastase
Synonyms:
Bone marrow serine protease Coagulation factor X ELANE Elastase HLE Leukocyte elastase Medullasin Neutrophil elastase (HNE) PMN elastase Trypsin
Type:
Enzyme
Mol. Mass.:
28532.38
Organism:
Homo sapiens (Human)
Description:
P08246
Residue:
267
  
Inhibitor
Name:
BDBM50199883
Synonyms:
3,4‐Dichloroisocoumarin (2) 3,4-dichloro-1H-isochromen-1-one CHEMBL24983 | cid_1609
Type:
Small organic molecule
Emp. Form.:
C9H4Cl2O2
Mol. Mass.:
215.033
SMILES:
Clc1oc(=O)c2ccccc2c1Cl
: