Target
3-phosphoshikimate 1-carboxyvinyltransferase
Ligand
BDBM50281352
Substrate
Meas. Tech.
ChEBML_65093
IC50
700000±n/a nM
Citation
 Knowles, WSAnderson, KSAndrew, SSPhillion, DPReam, JEJohnson, KASikorski, JA Synthesis & characterization of N-amino-glyphosate as a potent analog inhibitor of E. coli EPSP synthase. Bioorg Med Chem Lett 3:2863-2868 (1993)    Article 
Target
Name:
3-phosphoshikimate 1-carboxyvinyltransferase
Synonyms:
5-enolpyruvylshikimate-3-phosphate synthase aroA
Type:
PROTEIN
Mol. Mass.:
46089.22
Organism:
Escherichia coli (strain K12)
Description:
ChEMBL_65087
Residue:
427
  
Inhibitor
Name:
BDBM50281352
Synonyms:
(Hydroxyphosphinoylmethyl-amino)-acetic acid | CHEMBL98752
Type:
Small organic molecule
Emp. Form.:
C3H6NO4P
Mol. Mass.:
151.0578
SMILES:
OP(O)C=NCC(O)=O
: