Target
Amiloride-sensitive amine oxidase [copper-containing]
Ligand
BDBM50281515
Substrate
Meas. Tech.
ChEBML_53890
Ki
170±n/a nM
Citation
 Griffith, RKDiPietro, RA Synthesis of 4(5)-imidazolyl allylamines and propargylamines as inhibitors of diamine oxidase Bioorg Med Chem Lett 3:353-356 (1993)    Article 
Target
Name:
Amiloride-sensitive amine oxidase [copper-containing]
Synonyms:
ABP AOC1 Amiloride-binding protein DAO1 Diamine oxidase (DAO) KAO | Kidney amine oxidase
Type:
Protein
Mol. Mass.:
85387.64
Organism:
Homo sapiens (Human)
Description:
P19801
Residue:
751
  
Inhibitor
Name:
BDBM50281515
Synonyms:
(E)-3-(1H-Imidazol-4-yl)-allylamine CHEMBL330979
Type:
Small organic molecule
Emp. Form.:
C6H9N3
Mol. Mass.:
123.1558
SMILES:
NCC=Cc1cnc[nH]1
: