Target
Endothelin-1 receptor
Ligand
BDBM50281581
Substrate
Meas. Tech.
ChEBML_65790
IC50
70±n/a nM
Citation
 Spellmeyer, DCBrown, SStauber, GBGeysen, HValerio, R Endothelin receptor ligands. replacement net approach to SAR determination of potent hexapeptides Bioorg Med Chem Lett 3:519-524 (1993)    Article 
Target
Name:
Endothelin-1 receptor
Synonyms:
EDNRA_MOUSE Endothelin receptor ET-A | Gpcr10
Type:
PROTEIN
Mol. Mass.:
48591.87
Organism:
Mus musculus
Description:
ChEMBL_723169
Residue:
427
  
Inhibitor
Name:
BDBM50281581
Synonyms:
(S)-3-[(S)-2-((R)-2-Acetylamino-3-phenyl-propionylamino)-4-phenyl-butyrylamino]-N-((1S,2R)-1-{(1S,2R)-1-[(S)-1-carboxy-2-(1H-indol-3-yl)-ethylcarbamoyl]-2-methyl-butylcarbamoyl}-2-methyl-butyl)-succinamic acid | CHEMBL433893
Type:
Small organic molecule
Emp. Form.:
C48H61N7O10
Mol. Mass.:
896.0388
SMILES:
CC[C@@H](C)[C@H](NC(=O)[C@H](CC(O)=O)NC(=O)[C@H](CCc1ccccc1)NC(=O)[C@@H](Cc1ccccc1)NC(C)=O)C(=O)N[C@@H]([C@H](C)CC)C(=O)N[C@@H](Cc1c[nH]c2ccccc12)C(O)=O
: