Target
Neurotensin receptor type 1
Ligand
BDBM50281784
Substrate
Meas. Tech.
ChEMBL_144293 (CHEMBL754794)
Ki
0.210000±n/a nM
Citation
 Henry, JAHorwell, DCMeecham, KGRees, DC A structure-affinity study of the amino acid side-chains in neurotensin : N and C terminal deletions and Ala-scan Bioorg Med Chem Lett 3:949-952 (1993)    Article 
Target
Name:
Neurotensin receptor type 1
Synonyms:
NT-R-1 Neurotensin 1 Neurotensin receptor type 1 Ntsr1
Type:
Enzyme Catalytic Domain
Mol. Mass.:
47237.04
Organism:
MOUSE
Description:
Neurotensin 1 NTSR1 MOUSE::A2ACT4
Residue:
424
  
Inhibitor
Name:
BDBM50281784
Synonyms:
Ac-Tyr-Glu-Asn-Lys-Pro-Arg-Arg-Pro-Tyr-Ile-Leu-OH | CHEMBL413433
Type:
Small organic molecule
Emp. Form.:
C69H107N19O18
Mol. Mass.:
1490.7044
SMILES:
CC[C@@H](C)[C@H](NC(=O)[C@H](Cc1ccc(O)cc1)NC(=O)[C@@H]1CCCN1C(=O)[C@H](CCCNC(N)=N)NC(=O)[C@H](CCCNC(N)=N)NC(=O)[C@@H]1CCCN1C(=O)[C@H](CCCCN)NC(=O)[C@H](CC(N)=O)NC(=O)[C@H](CCC(O)=O)NC(=O)[C@H](Cc1ccc(O)cc1)NC(C)=O)C(=O)N[C@@H](CC(C)C)C(O)=O
: