Target
Neurotensin receptor type 1
Ligand
BDBM50281808
Substrate
Meas. Tech.
ChEBML_144305
Ki
>10000±n/a nM
Citation
 Christos, TEArvanitis, ACain, GAJohnson, ALPottorf, RSTam, SSchmidt, WK Stable isosteres of neurotensin c-terminal pentapeptides derived by modification of the amide function Bioorg Med Chem Lett 3:1035-1040 (1993)    Article 
Target
Name:
Neurotensin receptor type 1
Synonyms:
NTR1_RAT Ntsr | Ntsr1
Type:
PROTEIN
Mol. Mass.:
47070.64
Organism:
Rattus norvegicus
Description:
ChEMBL_1466612
Residue:
424
  
Inhibitor
Name:
BDBM50281808
Synonyms:
(S)-2-((2S,3S)-2-{N'-[(S)-3-{[(S)-1-((S)-5-Amino-2-tert-butoxycarbonylamino-pentanoyl)-pyrrolidine-2-carbonyl]-amino}-4-(4-hydroxy-phenyl)-2-oxo-butyl]-hydrazino}-3-methyl-pentanoylamino)-4-methyl-pentanoic acid | CHEMBL269581
Type:
Small organic molecule
Emp. Form.:
C37H61N7O9
Mol. Mass.:
747.9217
SMILES:
CC[C@H](C)[C@H](NNCC(=O)[C@H](Cc1ccc(O)cc1)NC(=O)[C@@H]1CCCN1C(=O)[C@H](CCCN)NC(=O)OC(C)(C)C)C(=O)N[C@@H](CC(C)C)C(O)=O
: