Target
Leukotriene B4 receptor 1
Ligand
BDBM50281873
Substrate
Meas. Tech.
ChEMBL_98504 (CHEMBL709166)
Ki
10±n/a nM
Citation
 Sofia, MJFloreancig, PJackson, WTMarder, PSaussy, DLSilbaugh, SACockerham, SLFroelich, LLRoman, CRStengel, PWFleisch, JH Acid unit modifications of 1,2,4,5-substituted hydroxyacetophenones and the effect on in vitro and in vivo LTB4 receptor antagonism Bioorg Med Chem Lett 3:1147-1152 (1993)    Article 
Target
Name:
Leukotriene B4 receptor 1
Synonyms:
BLT BLTR Chemoattractant receptor-like 1 GPR16 LTB4-R 1 Leukotriene B4 R1 Leukotriene B4 receptor 1 P2Y purinoceptor 7 | P2Y7
Type:
Enzyme Catalytic Domain
Mol. Mass.:
37582.68
Organism:
Homo sapiens (Human)
Description:
Q15722
Residue:
352
  
Inhibitor
Name:
BDBM50281873
Synonyms:
CHEMBL15559 | Sodium; 7-[3-(4-acetyl-2-ethyl-5-hydroxy-phenoxy)-propoxy]-8-propyl-chroman-2-carboxylate
Type:
Small organic molecule
Emp. Form.:
C26H31O7
Mol. Mass.:
455.5207
SMILES:
CCCc1c(OCCCOc2cc(O)c(cc2CC)C(C)=O)ccc2CCC(Oc12)C([O-])=O
: