Target
Thromboxane A2 receptor
Ligand
BDBM50282153
Substrate
Meas. Tech.
ChEBML_210120
IC50
590000±n/a nM
Citation
 Yokota, MImamaki, KUchibori, SKondo, MKosakai, KTomiyama, T Role of sulfonamide moiety in non-prostanoid txa2 receptor antagonist kt2-962 : modifications of this moiety and the resulting activities Bioorg Med Chem Lett 3:1687-1692 (1993)    Article 
Target
Name:
Thromboxane A2 receptor
Synonyms:
TA2R_RAT Tbxa2r | Thromboxane A2
Type:
Enzyme Catalytic Domain
Mol. Mass.:
36943.05
Organism:
RAT
Description:
Thromboxane A2 TBXA2R RAT::P34978
Residue:
341
  
Inhibitor
Name:
BDBM50282153
Synonyms:
CHEMBL47635 | Thiosemicarbazone Derivative
Type:
Small organic molecule
Emp. Form.:
C25H26N3O2S
Mol. Mass.:
432.558
SMILES:
CC(C)c1ccc2c(CCCC=NNC(=S)Nc3ccccc3)cc(C([O-])=O)c2cc1
: