Target
Type-1 angiotensin II receptor
Ligand
BDBM50003266
Substrate
Meas. Tech.
ChEMBL_35259 (CHEMBL648565)
IC50
4530±n/a nM
Citation
 Weinstock, JHill, DTKeenan, RMFranz, RGGaitanopoulos, DEGirard, GREggleston, DSAiyar, NGriffin, EOhlstein, EBrooks, DPGellai, MFrederickson, TAWeidley, EFEdwards, RM A potent long-acting imidazole-5-acrylic acid angiotensin II AT-1 receptor antagonist Bioorg Med Chem Lett 4:23-28 (1994)    Article 
Target
Name:
Type-1 angiotensin II receptor
Synonyms:
AGTR1 AGTR1B AT1 AT1BR AT2R1B Angiotensin II receptor Type-1 angiotensin II receptor (AT1)
Type:
Protein
Mol. Mass.:
41080.75
Organism:
Homo sapiens (Human)
Description:
P30556
Residue:
359
  
Inhibitor
Name:
BDBM50003266
Synonyms:
(E)-3-[2-Butyl-3-(2-chloro-benzyl)-3H-imidazol-4-yl]-2-thiophen-2-ylmethyl-acrylic acid CHEMBL289543
Type:
Small organic molecule
Emp. Form.:
C22H23ClN2O2S
Mol. Mass.:
414.948
SMILES:
CCCCc1ncc(\C=C(/Cc2cccs2)C(O)=O)n1Cc1ccccc1Cl
: