Target
Mu-type opioid receptor
Ligand
BDBM50283036
Substrate
Meas. Tech.
ChEBML_138889
Ki
7.5±n/a nM
Citation
 Sasaki, YWatanabe, YAmbo, ASuzuki, K Synthesis and biological properties of quaternized N-methylation analogs of D-Arg-2-dermorphin tetrapeptide Bioorg Med Chem Lett 4:2049-2054 (1994)    Article 
Target
Name:
Mu-type opioid receptor
Synonyms:
MOR-1 Mu-type opioid receptor (MOR) OPRM_RAT Opioid receptor B Ror-b
Type:
G Protein-Coupled Receptor (GPCR)
Mol. Mass.:
44503.11
Organism:
Rattus norvegicus (rat)
Description:
Competition binding assays were carried out using membrane preparations from transfected HN9.10 cells that constitutively expressed the mu opioid receptor.
Residue:
398
  
Inhibitor
Name:
BDBM50283036
Synonyms:
CHEMBL294785 | [(S)-3-((S)-2-{(S)-2-[(S)-2-Amino-3-(4-hydroxy-phenyl)-propionylamino]-5-guanidino-pentanoylamino}-3-phenyl-propionylamino)-3-carbamoyl-propyl]-trimethyl-ammonium
Type:
Small organic molecule
Emp. Form.:
C31H48N9O5
Mol. Mass.:
626.7696
SMILES:
C[N+](C)(C)CC[C@H](NC(=O)[C@H](Cc1ccccc1)NC(=O)[C@H](CCCNC(N)=N)NC(=O)[C@@H](N)Cc1ccc(O)cc1)C(N)=O
: