Target
Thromboxane-A synthase
Ligand
BDBM50025953
Substrate
Meas. Tech.
ChEBML_210279
IC50
3±n/a nM
Citation
 Vlattas, IDellureficio, JCohen, DSLee, WClarke, FDotson, RMathis, JZoganas, H Thia-prostanoid analogs with combined thromboxane receptor antagonist/thromboxane synthase inhibitor activities. Synthesis and pharmacological evaluation Bioorg Med Chem Lett 4:2067-2072 (1994)    Article 
Target
Name:
Thromboxane-A synthase
Synonyms:
CYP5 Cytochrome P450 5A1 TBXAS1 TXA synthase TXS Thromboxane A2 Synthase (P450 TxA2) Thromboxane prostanoid Thromboxane-A synthase
Type:
Enzyme
Mol. Mass.:
60524.67
Organism:
Homo sapiens (Human)
Description:
P24557
Residue:
533
  
Inhibitor
Name:
BDBM50025953
Synonyms:
6-Imidazo[1,5-a]pyridin-5-yl-hexanoic acid CHEMBL48092
Type:
Small organic molecule
Emp. Form.:
C13H16N2O2
Mol. Mass.:
232.2783
SMILES:
OC(=O)CCCCCc1cccc2cncn12
: