Target
Gag-Pol polyprotein [489-587]
Ligand
BDBM519
Substrate
Meas. Tech.
ChEBML_79468
IC50
0.200000±n/a nM
Citation
 Smith, RAColes, PJChen, JJRobinson, VJMacDonald, ICarrière, JKrantz, A Design, synthesis, and activity of conformationally-constrained macrocyclic peptide-based inhibitors of HIV protease Bioorg Med Chem Lett 4:2217-2222 (1994)    Article 
Target
Name:
Gag-Pol polyprotein [489-587]
Synonyms:
Human immunodeficiency virus type 1 protease Pol polyprotein | gag-pol
Type:
Enzyme Subunit
Mol. Mass.:
10781.16
Organism:
Human immunodeficiency virus type 1
Description:
P04585[489-587]
Residue:
99
  
Inhibitor
Name:
BDBM519
Synonyms:
(2S)-N-[(2S,3R)-4-[(3S,4aS,8aS)-3-(tert-butylcarbamoyl)-decahydroisoquinolin-2-yl]-3-hydroxy-1-phenylbutan-2-yl]-2-(quinolin-2-ylformamido)butanediamide Fortovase Ro 31-8959 Saquinavir
Type:
Small organic molecule
Emp. Form.:
C38H50N6O5
Mol. Mass.:
670.8408
SMILES:
CC(C)(C)NC(=O)[C@@H]1C[C@@H]2CCCC[C@@H]2CN1C[C@@H](O)[C@H](Cc1ccccc1)NC(=O)[C@H](CC(N)=O)NC(=O)c1ccc2ccccc2n1
: