Target
Type-1 angiotensin II receptor A/B
Ligand
BDBM50283302
Substrate
Meas. Tech.
ChEMBL_34964 (CHEMBL647886)
IC50
0.300000±n/a nM
Citation
 Glinka, TWde Laszlo, SESiegl, PKChang, RSKivlighn, SDSchorn, TSFaust, KAChen, TBZingaro, GJLotti, VJGreenlee, WJ Development of angiotensin II antagonists with equipotent affinity for human AT1 and AT2 receptor subtypes. Bioorg Med Chem Lett 4:2337-2342 (1994)    Article 
Target
Name:
Type-1 angiotensin II receptor A/B
Synonyms:
Angiotensin II receptor (AT-1) type-1 | Type-1A/Type-1B angiotensin II receptor
Type:
Mol. Mass.:
Description:
ASSAY_ID of ChEMBL is 901964
Components:
This complex has 2 components.
Component 1
Name:
Type-1 angiotensin II receptor B
Synonyms:
AGTRB_RAT Agtr1 Angiotensin II AT1B Angiotensin II type 1b (AT-1b) receptor Type-1B angiotensin II receptor
Type:
Enzyme Catalytic Domain
Mol. Mass.:
40929.44
Organism:
RAT
Description:
Angiotensin II AT1B 0 RAT::P29089
Residue:
359
  
Component 2
Name:
Type-1 angiotensin II receptor A
Synonyms:
AGTRA_RAT Agtr1 Angiotensin II AT1 Angiotensin II receptor (AT-1) type-1 Type-1A angiotensin II receptor
Type:
Enzyme Catalytic Domain
Mol. Mass.:
40910.53
Organism:
RAT
Description:
ANGIOTENSIN AT1 AGTR1 RAT::P25095
Residue:
359
  
Inhibitor
Name:
BDBM50283302
Synonyms:
2-ethyl-3-(3-fluoro-2'-(3-methyl-butyloxycarbonylaminosulphonyl)-biphenyl-4-ylmethyl)-6-(N-isopropyl-N-methyl-aminocarbonylamino)-3H-quinazolin-4-one | CHEMBL74442
Type:
Small organic molecule
Emp. Form.:
C34H40FN5O6S
Mol. Mass.:
665.775
SMILES:
CCc1nc2ccc(NC(=O)N(C)C(C)C)cc2c(=O)n1Cc1ccc(cc1F)-c1ccccc1S(=O)(=O)NC(=O)OCCC(C)C
: