Target
Proprotein convertase subtilisin/kexin type 9
Ligand
BDBM26996
Substrate
Meas. Tech.
ChEBML_206131
Ki
470000±n/a nM
Citation
 Steiner, SJBien, JTSmith, BD Diphenylborinic acid is a strong inhibitor of serine proteases Bioorg Med Chem Lett 4:2417-2420 (1994)    Article 
Target
Name:
Proprotein convertase subtilisin/kexin type 9
Synonyms:
NARC-1 Neural apoptosis-regulated convertase 1 PCSK9 Proprotein convertase 9 Proprotein convertase subtilisin/kexin type 9 (PCSK9) Subtilisin/kexin-like protease PC9
Type:
Enzyme
Mol. Mass.:
74286.93
Organism:
Homo sapiens (Human)
Description:
Q8NBP7
Residue:
692
  
Inhibitor
Name:
BDBM26996
Synonyms:
CHEMBL21485 Phenyl-boronic acid benzeneboronic acid phenylboronic acid
Type:
Emp. Form.:
C6H7BO2
Mol. Mass.:
121.93
SMILES:
OB(O)c1ccccc1
: