Target
Geranylgeranyl transferase type-1 subunit beta/Protein farnesyltransferase/geranylgeranyltransferase type-1 subunit alpha
Ligand
BDBM50283736
Substrate
Meas. Tech.
ChEMBL_71802 (CHEMBL683486)
IC50
90±n/a nM
Citation
 Harrington, EMKowalczyk, JJPinnow, SLAckermann, KGarcia, AMLewis, MD Cysteine and methionine linked by carbon pseudopeptides inhibit farnesyl transferase Bioorg Med Chem Lett 4:2775-2780 (1994)    Article 
Target
Name:
Geranylgeranyl transferase type-1 subunit beta/Protein farnesyltransferase/geranylgeranyltransferase type-1 subunit alpha
Synonyms:
Geranylgeranyl transferase type I Geranylgeranyl transferase type I beta/Protein farnesyltransferase/geranylgeranyltransferase type I alpha subunit
Type:
Mol. Mass.:
Description:
ASSAY_ID of EBI is 70196
Components:
This complex has 2 components.
Component 1
Name:
Protein farnesyltransferase/geranylgeranyltransferase type-1 subunit alpha
Synonyms:
CAAX farnesyltransferase alpha subunit FNTA_HUMAN FTase-alpha Geranylgeranyl Transferase (GGTase-I) Chain A Protein Farnesyltransferase (PFT) Chain A Protein farnesyltransferase Protein farnesyltransferase/geranylgeranyltransferase type I alpha subunit | Ras proteins prenyltransferase alpha
Type:
Enzyme
Mol. Mass.:
44392.46
Organism:
Homo sapiens (Human)
Description:
Recombinant human FTase.
Residue:
379
  
Component 2
Name:
Geranylgeranyl transferase type-1 subunit beta
Synonyms:
2.5.1.59 Geranylgeranyl transferase type I Geranylgeranyl transferase type I subunit beta PGGT1B Protein farnesyl/geranylgeranyl transferase | Type I protein geranyl-geranyltransferase subunit beta
Type:
Mol. Mass.:
42369.84
Organism:
Homo sapiens (Human)
Description:
Residue:
377
  
Inhibitor
Name:
BDBM50283736
Synonyms:
(S)-2-[5-((R)-2-Amino-3-mercapto-propionylamino)-2-(4-fluoro-benzyl)-pentanoylamino]-4-methylsulfanyl-butyric acid | CHEMBL96413
Type:
Small organic molecule
Emp. Form.:
C20H30FN3O4S2
Mol. Mass.:
459.598
SMILES:
CSCC[C@H](NC(=O)C(CCCNC(=O)[C@@H](N)CS)Cc1ccc(F)cc1)C(O)=O
: