Target
Peptidyl-prolyl cis-trans isomerase FKBP1A
Ligand
BDBM50284192
Substrate
Meas. Tech.
ChEBML_66282
EC50
7±n/a nM
Citation
 Goulet, MTHodkey, DWStaruch, MJDumont, FJLin, SHung, SHSiekierka, JJWyvratt, MJ Alkyl ether derivatives of the FK-506 related, immunosuppressive macrolide L-683,742 (C31-O-desmethyl ascomycin) Bioorg Med Chem Lett 4:927-930 (1994)    Article 
Target
Name:
Peptidyl-prolyl cis-trans isomerase FKBP1A
Synonyms:
12 kDa FK506-binding protein FK506-binding protein 1A FKB1A_HUMAN FKBP-1A FKBP12 Immunophilin FKBP12 PPIase FKBP1A Rotamase mTOR/FKBP12A/FKBP12B
Type:
Isomerase
Mol. Mass.:
11953.09
Organism:
Homo sapiens (Human)
Description:
P62942
Residue:
108
  
Inhibitor
Name:
BDBM50284192
Synonyms:
C32-O-cinnamyl ether analogue of L-683590 | CHEMBL366891
Type:
Small organic molecule
Emp. Form.:
C46H73NO12
Mol. Mass.:
832.0713
SMILES:
CC[C@@H]1\C=C(C)\C[C@H](C)C[C@H](OC)[C@H]2OC(O)([C@@H](C)C[C@@H]2OC)C(=O)C(=O)N2CCCC[C@H]2C(=O)O[C@@H]([C@H](C)[C@@H](O)CC1=O)C(\C)=C\[C@@H]1CC[C@@H](O)[C@@H](C1)OC\C=C\C
: