Target
Beta-lactamase
Ligand
BDBM50240349
Substrate
Meas. Tech.
ChEMBL_216031 (CHEMBL819739)
Kd
400±n/a nM
Citation
 Miyashita, KMobashery, S Mechanistic support for the stepwise process for inactivation of class A β-lactamases by clavulanate Bioorg Med Chem Lett 5:1043-1048 (1995)    Article 
Target
Name:
Beta-lactamase
Synonyms:
AMPC_ENTCL | ampC
Type:
PROTEIN
Mol. Mass.:
41306.67
Organism:
Enterobacter cloacae
Description:
ChEMBL_40258
Residue:
381
  
Inhibitor
Name:
BDBM50240349
Synonyms:
CHEMBL9306 lithium (2R,5R,Z)-3-(2-hydroxyethylidene)-7-oxo-4-oxa-1-aza-bicyclo[3.2.0]heptane-2-carboxylate
Type:
Small organic molecule
Emp. Form.:
C8H8NO5
Mol. Mass.:
198.1534
SMILES:
OC\C=C1/O[C@@H]2CC(=O)N2[C@H]1C([O-])=O
: