Target
Polyunsaturated fatty acid 5-lipoxygenase
Ligand
BDBM50284492
Substrate
Meas. Tech.
ChEMBL_3906 (CHEMBL882929)
IC50
23000±n/a nM
Citation
 Gallagher, TFFier-Thompson, SMGarigipati, RSSorenson, MESmietana, JMLee, DBender, PELee, JCLaydon, JTGriswold, DEChabot-Fletcher, MCBreton, JJAdams, JL 2,4,5- triarylimidazole inhibitors of IL-1 biosynthesis Bioorg Med Chem Lett 5:1171-1176 (1995)    Article 
Target
Name:
Polyunsaturated fatty acid 5-lipoxygenase
Synonyms:
Alox5 LOX5_RAT
Type:
PROTEIN
Mol. Mass.:
78082.31
Organism:
Rattus norvegicus
Description:
ChEMBL_1432947
Residue:
673
  
Inhibitor
Name:
BDBM50284492
Synonyms:
4-[5-(4-Fluoro-phenyl)-2-(4-methanesulfinyl-phenyl)-3H-imidazol-4-yl]-3-methyl-pyridine | CHEMBL280265
Type:
Small organic molecule
Emp. Form.:
C22H18FN3OS
Mol. Mass.:
391.461
SMILES:
Cc1cnccc1-c1nc([nH]c1-c1ccc(F)cc1)-c1ccc(cc1)S(C)=O
: