Target
Polyunsaturated fatty acid 5-lipoxygenase
Ligand
BDBM50284513
Substrate
Meas. Tech.
ChEMBL_3906 (CHEMBL882929)
IC50
5600±n/a nM
Citation
 Gallagher, TFFier-Thompson, SMGarigipati, RSSorenson, MESmietana, JMLee, DBender, PELee, JCLaydon, JTGriswold, DEChabot-Fletcher, MCBreton, JJAdams, JL 2,4,5- triarylimidazole inhibitors of IL-1 biosynthesis Bioorg Med Chem Lett 5:1171-1176 (1995)    Article 
Target
Name:
Polyunsaturated fatty acid 5-lipoxygenase
Synonyms:
Alox5 LOX5_RAT
Type:
PROTEIN
Mol. Mass.:
78082.31
Organism:
Rattus norvegicus
Description:
ChEMBL_1432947
Residue:
673
  
Inhibitor
Name:
BDBM50284513
Synonyms:
CHEMBL17325 | {4-[4-(4-Fluoro-phenyl)-5-pyridin-4-yl-1H-imidazol-2-yl]-phenyl}-dimethyl-amine
Type:
Small organic molecule
Emp. Form.:
C22H19FN4
Mol. Mass.:
358.4115
SMILES:
CN(C)c1ccc(cc1)-c1nc(c([nH]1)-c1ccc(F)cc1)-c1ccncc1
: