Target
Polyunsaturated fatty acid 5-lipoxygenase
Ligand
BDBM50230001
Substrate
Meas. Tech.
ChEMBL_3906 (CHEMBL882929)
IC50
8000±n/a nM
Citation
 Gallagher, TFFier-Thompson, SMGarigipati, RSSorenson, MESmietana, JMLee, DBender, PELee, JCLaydon, JTGriswold, DEChabot-Fletcher, MCBreton, JJAdams, JL 2,4,5- triarylimidazole inhibitors of IL-1 biosynthesis Bioorg Med Chem Lett 5:1171-1176 (1995)    Article 
Target
Name:
Polyunsaturated fatty acid 5-lipoxygenase
Synonyms:
Alox5 LOX5_RAT
Type:
PROTEIN
Mol. Mass.:
78082.31
Organism:
Rattus norvegicus
Description:
ChEMBL_1432947
Residue:
673
  
Inhibitor
Name:
BDBM50230001
Synonyms:
4-(4-(4-fluorophenyl)-2-(4-nitrophenyl)-1H-imidazol-5-yl)pyridine 4-[5-(4-Fluoro-phenyl)-2-(4-nitro-phenyl)-3H-imidazol-4-yl]-pyridine PD-169316
Type:
Small organic molecule
Emp. Form.:
C20H13FN4O2
Mol. Mass.:
360.3412
SMILES:
[O-][N+](=O)c1ccc(cc1)-c1nc(c([nH]1)-c1ccc(F)cc1)-c1ccncc1
: