Target
Polyunsaturated fatty acid 5-lipoxygenase
Ligand
BDBM50284481
Substrate
Meas. Tech.
ChEMBL_88003 (CHEMBL697605)
IC50
2300±n/a nM
Citation
 Gallagher, TFFier-Thompson, SMGarigipati, RSSorenson, MESmietana, JMLee, DBender, PELee, JCLaydon, JTGriswold, DEChabot-Fletcher, MCBreton, JJAdams, JL 2,4,5- triarylimidazole inhibitors of IL-1 biosynthesis Bioorg Med Chem Lett 5:1171-1176 (1995)    Article 
Target
Name:
Polyunsaturated fatty acid 5-lipoxygenase
Synonyms:
5-LO 5-Lipoxygenase (5-LO) 5-Lipoygenase ALOX5 LOG5 | LOX5_HUMAN
Type:
Enzyme
Mol. Mass.:
77972.74
Organism:
Homo sapiens (Human)
Description:
Recombinant protein was purified from E. coli lysate. After ammonium sulfate precipitation and subsequent steps, the supernatant (S100) was used for 5-LO activity assay.
Residue:
674
  
Inhibitor
Name:
BDBM50284481
Synonyms:
Benzyl-{4-[4-(4-fluoro-phenyl)-5-pyridin-4-yl-1H-imidazol-2-yl]-benzyl}-methyl-amine | CHEMBL279767
Type:
Small organic molecule
Emp. Form.:
C29H25FN4
Mol. Mass.:
448.534
SMILES:
CN(Cc1ccccc1)Cc1ccc(cc1)-c1nc(c([nH]1)-c1ccc(F)cc1)-c1ccncc1
: