Target
Neutrophil collagenase
Ligand
BDBM50284753
Substrate
Meas. Tech.
ChEBML_105202
Ki
0.500000±n/a nM
Citation
 Castelhano, ALBilledeau, RDewdney, NDonnelly, SHorne, SKurz, LJLiak, TJMartin, RUppington, RYuan, ZKrantz, A Novel indolactam-based inhibitors of matrix metalloproteinases Bioorg Med Chem Lett 5:1415-1420 (1995)    Article 
Target
Name:
Neutrophil collagenase
Synonyms:
CLG1 MMP8 Matrix metalloproteinase-8 PMNL collagenase | PMNL-CL
Type:
Enzyme
Mol. Mass.:
53413.48
Organism:
Homo sapiens (Human)
Description:
P22894
Residue:
467
  
Inhibitor
Name:
BDBM50284753
Synonyms:
(R)-N*1*-[(S)-1-Hexylcarbamoyl-2-(1H-indol-3-yl)-ethyl]-N*4*-hydroxy-2-isobutyl-succinamide | CHEMBL285418
Type:
Small organic molecule
Emp. Form.:
C25H38N4O4
Mol. Mass.:
458.5936
SMILES:
CCCCCCNC(=O)[C@H](Cc1c[nH]c2ccccc12)NC(=O)[C@H](CC(C)C)CC(=O)NO
: