Target
Glutamate receptor ionotropic, NMDA 1
Ligand
BDBM50284808
Substrate
Meas. Tech.
ChEBML_140325
Ki
3±n/a nM
Citation
 Nagata, RAe, NTanno, N Structure-activity relationships of tricyclic quinoxalinediones as potent antagonists for the glycine binding site of the NMDA receptor 1 Bioorg Med Chem Lett 5:1527-1532 (1995)    Article 
Target
Name:
Glutamate receptor ionotropic, NMDA 1
Synonyms:
Glutamate (NMDA) receptor subunit zeta 1 Glutamate-NMDA-Channel Glutamate-NMDA-Polyamine NMDA Nmdar1 | phencyclidine
Type:
Enzyme Catalytic Domain
Mol. Mass.:
105533.40
Organism:
RAT
Description:
P35439
Residue:
938
  
Inhibitor
Name:
BDBM50284808
Synonyms:
2-((5R,6S)-9-Bromo-6-methyl-2,3-dioxo-2,3,6,7-tetrahydro-1H,5H-pyrido[1,2,3-de]quinoxalin-5-yl)-N-phenyl-acetamide | CHEMBL290963
Type:
Small organic molecule
Emp. Form.:
C20H18BrN3O3
Mol. Mass.:
428.279
SMILES:
C[C@H]1Cc2cc(Br)cc3[nH]c(=O)c(=O)n([C@@H]1CC(=O)Nc1ccccc1)c23
: