Target
Gag-Pol polyprotein [489-587]
Ligand
BDBM50284930
Substrate
Meas. Tech.
ChEBML_159320
IC50
60.0±n/a nM
Citation
 Ahmad, SAshfaq, AAlam, MBisacchi, GSChen, PCheng, PTGreytok, JAHermsmeier, MALin, PFLis, KAMerchant, ZMitt, TSkoog, MSpergel, SHTino, JAVite, GDColonno, RJZahler, RBarrish, JC α-hydroxyamide derived aminodiols as potent inhibitors of hiv protease Bioorg Med Chem Lett 5:1729-1734 (1995)    Article 
Target
Name:
Gag-Pol polyprotein [489-587]
Synonyms:
Human immunodeficiency virus type 1 protease Pol polyprotein | gag-pol
Type:
Enzyme Subunit
Mol. Mass.:
10781.16
Organism:
Human immunodeficiency virus type 1
Description:
P04585[489-587]
Residue:
99
  
Inhibitor
Name:
BDBM50284930
Synonyms:
CHEMBL49305 | {(1S,2R)-1-Benzyl-2-hydroxy-3-[(2R,3S)-2-hydroxy-3-(2-hydroxy-2-hydroxymethyl-3,3-dimethyl-butyrylamino)-4-phenyl-butylamino]-propyl}-carbamic acid tert-butyl ester
Type:
Small organic molecule
Emp. Form.:
C32H49N3O7
Mol. Mass.:
587.7474
SMILES:
CC(C)(C)OC(=O)N[C@@H](Cc1ccccc1)[C@H](O)CNC[C@@H](O)[C@H](Cc1ccccc1)NC(=O)C(O)(CO)C(C)(C)C
: