Target
Cholesteryl ester transfer protein
Ligand
BDBM50285086
Substrate
Meas. Tech.
ChEBML_48937
IC50
>50000±n/a nM
Citation
 Chackalamannil, SXia, YWang, YTsai, HCzarniecki, MWang, SClemmons, AAhn, HSBoykow, G Novel inhibitors of cholesteryl ester transfer protein Bioorg Med Chem Lett 5:2005-2010 (1995)    Article 
Target
Name:
Cholesteryl ester transfer protein
Synonyms:
CETP Cholesteryl ester transfer protein (CETP) | Lipid transfer protein I
Type:
Enzyme
Mol. Mass.:
54751.53
Organism:
Homo sapiens (Human)
Description:
P11597
Residue:
493
  
Inhibitor
Name:
BDBM50285086
Synonyms:
4-Benzyl-benzene-1,2-diol CHEMBL291507
Type:
Small organic molecule
Emp. Form.:
C13H12O2
Mol. Mass.:
200.2332
SMILES:
Oc1ccc(Cc2ccccc2)cc1O
: