Target
Chymotrypsin-like elastase family member 2A
Ligand
BDBM50281044
Substrate
Meas. Tech.
ChEBML_154799
IC50
150±n/a nM
Citation
 Boschetti, CEMata, EGMascaretti, OACricco, JACoux, GRoveri, OA Synthesis and porcine pancreatic elastase inhibitory evaluation of 6α-(sulfonyl)oxy-and 6α-chloropenicillanate sulfone esters and 3α-(acyloxy)methyl-6α-chloropenam sulfones Bioorg Med Chem Lett 5:2033-2036 (1995)    Article 
Target
Name:
Chymotrypsin-like elastase family member 2A
Synonyms:
CEL2A_PIG ELA2 Elastase 2A Elastase-2A | Pancreatic elastase
Type:
PROTEIN
Mol. Mass.:
28705.23
Organism:
Sus scrofa
Description:
ChEMBL_156951
Residue:
269
  
Inhibitor
Name:
BDBM50281044
Synonyms:
(2S,5R,6S)-3,3-Dimethyl-4,4,7-trioxo-6-(toluene-4-sulfonyloxy)-4lambda*6*-thia-1-aza-bicyclo[3.2.0]heptane-2-carboxylic acid benzyl ester | CHEMBL416849
Type:
Small organic molecule
Emp. Form.:
C22H23NO8S2
Mol. Mass.:
493.55
SMILES:
Cc1ccc(cc1)S(=O)(=O)O[C@@H]1[C@@H]2N([C@@H](C(=O)OCc3ccccc3)C(C)(C)S2(=O)=O)C1=O
: