Target
Beta-lactamase 1
Ligand
BDBM50285113
Substrate
Meas. Tech.
ChEBML_40228
IC50
1000000±n/a nM
Citation
 Danelon, GOMata, EGMascaretti, OAGirardini, JMarro, MRoveri, OA Synthesis and β-lactamase inhibitory evaluation of novel 6α-halo-2β-chloromethyl-2α-methylpenam-3α-carboxylic acids and their sulfones and 6α-halo-2β-mercaptobenzothiazolylmethyl-2α-methylpenam-3α-carboxylic acids Bioorg Med Chem Lett 5:2037-2040 (1995)    Article 
Target
Name:
Beta-lactamase 1
Synonyms:
BLAC_BACCE | blaY
Type:
PROTEIN
Mol. Mass.:
33326.66
Organism:
Bacillus cereus
Description:
ChEMBL_40230
Residue:
306
  
Inhibitor
Name:
BDBM50285113
Synonyms:
(2S,3R,5R,6S)-6-Bromo-3-chloromethyl-3-methyl-4,4,7-trioxo-4lambda*6*-thia-1-aza-bicyclo[3.2.0]heptane-2-carboxylic acid | CHEMBL64868
Type:
Small organic molecule
Emp. Form.:
C8H9BrClNO5S
Mol. Mass.:
346.583
SMILES:
C[C@]1(CCl)[C@@H](N2[C@@H]([C@@H](Br)C2=O)S1(=O)=O)C(O)=O
: