Target
Beta-lactamase 1
Ligand
BDBM50285121
Substrate
Meas. Tech.
ChEBML_40228
IC50
200000±n/a nM
Citation
 Danelon, GOMata, EGMascaretti, OAGirardini, JMarro, MRoveri, OA Synthesis and β-lactamase inhibitory evaluation of novel 6α-halo-2β-chloromethyl-2α-methylpenam-3α-carboxylic acids and their sulfones and 6α-halo-2β-mercaptobenzothiazolylmethyl-2α-methylpenam-3α-carboxylic acids Bioorg Med Chem Lett 5:2037-2040 (1995)    Article 
Target
Name:
Beta-lactamase 1
Synonyms:
BLAC_BACCE | blaY
Type:
PROTEIN
Mol. Mass.:
33326.66
Organism:
Bacillus cereus
Description:
ChEMBL_40230
Residue:
306
  
Inhibitor
Name:
BDBM50285121
Synonyms:
(2S,5R,6S)-6-Chloro-3,3-dimethyl-4,4,7-trioxo-4lambda*6*-thia-1-aza-bicyclo[3.2.0]heptane-2-carboxylic acid | CHEMBL304855
Type:
Small organic molecule
Emp. Form.:
C8H10ClNO5S
Mol. Mass.:
267.687
SMILES:
CC1(C)[C@@H](N2[C@@H]([C@@H](Cl)C2=O)S1(=O)=O)C(O)=O
: