Target
Sodium channel protein type 2 subunit alpha
Ligand
BDBM30705
Substrate
Meas. Tech.
ChEMBL_213122 (CHEMBL818201)
IC50
2200±n/a nM
Citation
 Reddy, NLConnaughton, SDaly, DFischer, JBGoldin, SMHu, LYSubbarao, KDurant, GJ Synthesis and characterization of N-(acenaphth-5-yl)-N'-(4-methoxynaphth-1-yl)guanidine as a glutamate release inhibitor and potential anti-ischemic agent Bioorg Med Chem Lett 5:2259-2262 (1995)    Article 
Target
Name:
Sodium channel protein type 2 subunit alpha
Synonyms:
HBSC II SCN2A SCN2A2 Sodium (Site 2) Sodium channel protein type 2 alpha subunit Voltage-gated sodium channel subunit alpha Nav1.2
Type:
Enzyme
Mol. Mass.:
227954.68
Organism:
Homo sapiens (Human)
Description:
Q99250
Residue:
2005
  
Inhibitor
Name:
BDBM30705
Synonyms:
CHEMBL744 RILUZOLE cid_5070
Type:
Small organic molecule
Emp. Form.:
C8H5F3N2OS
Mol. Mass.:
234.198
SMILES:
Nc1nc2ccc(OC(F)(F)F)cc2s1
: