Target
5-hydroxytryptamine receptor 1A
Ligand
BDBM50285316
Substrate
Meas. Tech.
ChEMBL_874 (CHEMBL615929)
IC50
2.27±n/a nM
Citation
 LeBoulluec, KLMattson, RJMahle, CDMcGovern, RTNowak, HPGentile, AJ Bivalent indoles exhibiting serotonergic binding affinity Bioorg Med Chem Lett 5:123-126 (1995)    Article 
Target
Name:
5-hydroxytryptamine receptor 1A
Synonyms:
5-HT-1A 5-HT1A 5-hydroxytryptamine receptor 1A (5HT1A) 5ht1a Htr1a Serotonin 1a (5-HT1a) receptor/Adrenergic receptor alpha-1 | Serotonin receptor 1A
Type:
G Protein-Coupled Receptor (GPCR)
Mol. Mass.:
46445.29
Organism:
Rattus norvegicus (rat)
Description:
Binding assays were performed using rat hippocampal membranes.
Residue:
422
  
Inhibitor
Name:
BDBM50285316
Synonyms:
3-(4-{6-[4-(5-carbamoyl-1H-3-indolyl)-3-cyclohexenylamino]hexylamino}-1-cyclohexenyl)-1H-5-indolecarboxamide | CHEMBL21862
Type:
Small organic molecule
Emp. Form.:
C36H44N6O2
Mol. Mass.:
592.7736
SMILES:
NC(=O)c1ccc2[nH]cc(C3=CCC(CC3)NCCCCCCNC3CCC(=CC3)c3c[nH]c4ccc(cc34)C(N)=O)c2c1
: