Target
Sterol O-acyltransferase 1
Ligand
BDBM50450365
Substrate
Meas. Tech.
ChEBML_28026
IC50
940±n/a nM
Citation
 Wilde, RGBillheimer, JT Acyl CoA:cholesterol acyltransferase (ACAT) inhibitors: ureas bearing two heterocyclic head groups Bioorg Med Chem Lett 5:173-6 (1995)   
Target
Name:
Sterol O-acyltransferase 1
Synonyms:
ACAT-1 Acetoacetyl-CoA thiolase Acyl coenzyme A:cholesterol acyltransferase 1 Cholesterol acyltransferase 1 Soat1 | Sterol O-acyltransferase 1
Type:
PROTEIN
Mol. Mass.:
63818.83
Organism:
Mus musculus
Description:
ChEMBL_90523
Residue:
540
  
Inhibitor
Name:
BDBM50450365
Synonyms:
CHEMBL298651
Type:
Small organic molecule
Emp. Form.:
C29H33N5OS
Mol. Mass.:
499.67
SMILES:
CC(C)NC(=O)N(CCCCCSc1nc(c([nH]1)-c1ccccc1)-c1ccccc1)c1ccccn1
: