Target
Sterol O-acyltransferase 1
Ligand
BDBM50450346
Substrate
Meas. Tech.
ChEBML_28026
IC50
10±n/a nM
Citation
 Wilde, RGBillheimer, JT Acyl CoA:cholesterol acyltransferase (ACAT) inhibitors: ureas bearing two heterocyclic head groups Bioorg Med Chem Lett 5:173-6 (1995)   
Target
Name:
Sterol O-acyltransferase 1
Synonyms:
ACAT-1 Acetoacetyl-CoA thiolase Acyl coenzyme A:cholesterol acyltransferase 1 Cholesterol acyltransferase 1 Soat1 | Sterol O-acyltransferase 1
Type:
PROTEIN
Mol. Mass.:
63818.83
Organism:
Mus musculus
Description:
ChEMBL_90523
Residue:
540
  
Inhibitor
Name:
BDBM50450346
Synonyms:
CHEMBL300883
Type:
Small organic molecule
Emp. Form.:
C48H58N6O5S2
Mol. Mass.:
863.141
SMILES:
COc1ccc(cc1)-c1nc(SCCCCCN(CCCCCSc2nc(c([nH]2)-c2ccc(OC)cc2)-c2ccc(OC)cc2)C(=O)NC(C)C)[nH]c1-c1ccc(OC)cc1
: