Target
Sterol O-acyltransferase 1
Ligand
BDBM50450362
Substrate
Meas. Tech.
ChEBML_28026
IC50
790±n/a nM
Citation
 Wilde, RGBillheimer, JT Acyl CoA:cholesterol acyltransferase (ACAT) inhibitors: ureas bearing two heterocyclic head groups Bioorg Med Chem Lett 5:173-6 (1995)   
Target
Name:
Sterol O-acyltransferase 1
Synonyms:
ACAT-1 Acetoacetyl-CoA thiolase Acyl coenzyme A:cholesterol acyltransferase 1 Cholesterol acyltransferase 1 Soat1 | Sterol O-acyltransferase 1
Type:
PROTEIN
Mol. Mass.:
63818.83
Organism:
Mus musculus
Description:
ChEMBL_90523
Residue:
540
  
Inhibitor
Name:
BDBM50450362
Synonyms:
CHEMBL297241
Type:
Small organic molecule
Emp. Form.:
C32H29F2N5OS
Mol. Mass.:
569.667
SMILES:
Fc1ccc(NC(=O)N(CCCCCSc2nc(c([nH]2)-c2ccccc2)-c2ccccc2)c2ccccn2)c(F)c1
: