Target
Sterol O-acyltransferase 1
Ligand
BDBM50285424
Substrate
Meas. Tech.
ChEBML_28031
IC50
500±n/a nM
Citation
 Wilde, RGKlaczkiewicz, JDBillheimer, JTWexler, RRGillies, PJ Acyl CoA:cholesterol acyltransferase (ACAT) inhibitors: heterocyclic bioisosteres for the urea group in DuP 128 Bioorg Med Chem Lett 5:177-180 (1995)    Article 
Target
Name:
Sterol O-acyltransferase 1
Synonyms:
ACAT-1 Acetoacetyl-CoA thiolase Acyl coenzyme A:cholesterol acyltransferase 1 Cholesterol acyltransferase 1 Soat1 | Sterol O-acyltransferase 1
Type:
PROTEIN
Mol. Mass.:
63818.83
Organism:
Mus musculus
Description:
ChEMBL_90523
Residue:
540
  
Inhibitor
Name:
BDBM50285424
Synonyms:
Benzooxazol-2-yl-{4-[4,5-bis-(4-methoxy-phenyl)-1H-imidazol-2-ylsulfanyl]-butyl}-heptyl-amine | CHEMBL300293
Type:
Small organic molecule
Emp. Form.:
C35H42N4O3S
Mol. Mass.:
598.798
SMILES:
CCCCCCCN(CCCCSc1nc(c([nH]1)-c1ccc(OC)cc1)-c1ccc(OC)cc1)c1nc2ccccc2o1
: