Target
Sterol O-acyltransferase 1
Ligand
BDBM50285423
Substrate
Meas. Tech.
ChEBML_28031
IC50
950±n/a nM
Citation
 Wilde, RGKlaczkiewicz, JDBillheimer, JTWexler, RRGillies, PJ Acyl CoA:cholesterol acyltransferase (ACAT) inhibitors: heterocyclic bioisosteres for the urea group in DuP 128 Bioorg Med Chem Lett 5:177-180 (1995)    Article 
Target
Name:
Sterol O-acyltransferase 1
Synonyms:
ACAT-1 Acetoacetyl-CoA thiolase Acyl coenzyme A:cholesterol acyltransferase 1 Cholesterol acyltransferase 1 Soat1 | Sterol O-acyltransferase 1
Type:
PROTEIN
Mol. Mass.:
63818.83
Organism:
Mus musculus
Description:
ChEMBL_90523
Residue:
540
  
Inhibitor
Name:
BDBM50285423
Synonyms:
1-{5-[4,5-Bis-(4-methoxy-phenyl)-1H-imidazol-2-ylsulfanyl]-pentyl}-2-methylsulfanyl-1H-benzoimidazole | CHEMBL51827
Type:
Small organic molecule
Emp. Form.:
C30H32N4O2S2
Mol. Mass.:
544.731
SMILES:
COc1ccc(cc1)-c1nc(SCCCCCn2c(SC)nc3ccccc23)[nH]c1-c1ccc(OC)cc1
: