Target
Gastrin/cholecystokinin type B receptor
Ligand
BDBM50040666
Substrate
Meas. Tech.
ChEBML_47817
IC50
0.280000±n/a nM
Citation
 Chambers, MSHobbs, SCGraham, MIWatt, APFletcher, SRBaker, RFreedman, SBPatel, SSmith, AJMatassa, VG Potent, selective, water-soluble benzodiazepine-based CCKB receptor antagonists that contain lipophilic carboxylate surrogates Bioorg Med Chem Lett 5:2303-2308 (1995)    Article 
Target
Name:
Gastrin/cholecystokinin type B receptor
Synonyms:
CCK-2 receptor CCK-BR CCKRB Cholecystokinin receptor GASR_HUMAN | Gastrin/cholecystokinin type B receptor
Type:
G Protein-Coupled Receptor (GPCR)
Mol. Mass.:
48445.79
Organism:
Homo sapiens (Human)
Description:
Stable expression of human CCK-2 receptors in HEK 293 cells.
Residue:
447
  
Inhibitor
Name:
BDBM50040666
Synonyms:
1-((R)-5-Cyclohexyl-1-methyl-2-oxo-2,3-dihydro-1H-benzo[e][1,4]diazepin-3-yl)-3-m-tolyl-urea L-708474
Type:
Small organic molecule
Emp. Form.:
C24H28N4O2
Mol. Mass.:
404.5047
SMILES:
CN1c2ccccc2C(=N[C@@H](NC(=O)Nc2cccc(C)c2)C1=O)C1CCCCC1
: