Target
1,3-beta-glucan synthase
Ligand
BDBM50285481
Substrate
Meas. Tech.
ChEBML_37687
IC50
10±n/a nM
Citation
 Zambias, RAJames, CHammond, MLAbruzzo, GKBartizal, KFNollstadt, KHDouglas, CMarrinan, JBalkovec, JM Antifungal lipopeptides: Structure-activity relationships of 3-hydroxyglutamine-modified pneumocandin B0 derivatives Bioorg Med Chem Lett 5:2357-2362 (1995)    Article 
Target
Name:
1,3-beta-glucan synthase
Synonyms:
1,3-beta-glucan synthase Glucan Synthase
Type:
Enzyme
Mol. Mass.:
218006.59
Organism:
Candida albicans (Yeast)
Description:
O13428
Residue:
1897
  
Inhibitor
Name:
BDBM50285481
Synonyms:
10,12-Dimethyl-tetradecanoic acid {3-(3-amino-1-hydroxy-propyl)-11,20,25-trihydroxy-15-(1-hydroxy-ethyl)-6-[1-hydroxy-2-(4-hydroxy-phenyl)-ethyl]-2,5,8,14,17,23-hexaoxo-1,4,7,13,16,22-hexaaza-tricyclo[22.3.0.0*9,13*]heptacos-18-yl}-amide | CHEMBL415670
Type:
Small organic molecule
Emp. Form.:
C50H82N8O14
Mol. Mass.:
1019.2313
SMILES:
CCC(C)CC(C)CCCCCCCCC(=O)N[C@H]1C[C@@H](O)CNC(=O)[C@@H]2[C@@H](O)CCN2C(=O)[C@@H](NC(=O)[C@@H](NC(=O)[C@@H]2C[C@@H](O)CN2C(=O)[C@@H](NC1=O)[C@@H](C)O)[C@H](O)Cc1ccc(O)cc1)[C@H](O)CCN
: