Target
Substance-K receptor
Ligand
BDBM50285954
Substrate
Meas. Tech.
ChEBML_209008
Ki
6600±n/a nM
Citation
 Jacobs, RTMauger, RCUlatowski, TGAharony, DBuckner, CK Substituted 2,4-diaminoquinazolines and 2,4-diamino-8-alkylpurines as antagonists of the neurokinin-2 (NK2) receptor Bioorg Med Chem Lett 5:2879-2884 (1995)    Article 
Target
Name:
Substance-K receptor
Synonyms:
NK2R_MESAU Neurokinin NK2 TACR2
Type:
Enzyme Catalytic Domain
Mol. Mass.:
43436.75
Organism:
HAMSTER
Description:
P51144
Residue:
384
  
Inhibitor
Name:
BDBM50285954
Synonyms:
(4-Chloro-phenyl)-(8-methyl-2-morpholin-4-yl-9H-purin-6-yl)-amine | CHEMBL327531
Type:
Small organic molecule
Emp. Form.:
C16H17ClN6O
Mol. Mass.:
344.799
SMILES:
Cc1nc2nc(nc(Nc3ccc(Cl)cc3)c2[nH]1)N1CCOCC1
: