Target
Platelet-activating factor receptor
Ligand
BDBM50286019
Substrate
Meas. Tech.
ChEBML_155151
Ki
240±n/a nM
Citation
 Sheppard, GSDavidsen, SKCarrera, GMPireh, DHolms, JHHeyman, HRSteinman, DHCurtin, MLConway, RGRhein, DAAlbert, DHTapang, PMagoc, TJSummers, JB Synthesis and evaluation of water soluble indole pyrrolothiazole paf antagonists Bioorg Med Chem Lett 5:2913-2918 (1995)    Article 
Target
Name:
Platelet-activating factor receptor
Synonyms:
PAF-R PTAFR_CAVPO Platelet-activating factor receptor
Type:
Protein
Mol. Mass.:
39005.63
Organism:
Cavia porcellus
Description:
Residue:
342
  
Inhibitor
Name:
BDBM50286019
Synonyms:
6-(2,4-Dioxo-1,2,3,4-tetrahydro-pyrimidin-5-yl)-3-((R)-3-pyridin-3-yl-1H-pyrrolo[1,2-c]thiazole-7-carbonyl)-indole-1-carboxylic acid dimethylamide | CHEMBL100159
Type:
Small organic molecule
Emp. Form.:
C27H22N6O4S
Mol. Mass.:
526.566
SMILES:
CN(C)C(=O)n1cc(C(=O)c2ccn3[C@H](SCc23)c2cccnc2)c2ccc(cc12)-c1c[nH]c(=O)[nH]c1=O
: